{"text_format":"1","workbook":"xlsx","n_sheets":4,"sheets":["Description of columns","Measures","Exchange rates to USD","selection lists"],"not_rendered":{"charts":0,"images":0,"macros":1,"external_links":1,"defined_names":4,"comments":1,"pivot_tables":0},"unopened":[],"bounds":{"document_bytes":16777216,"sheet_cells":100000,"rows_first":2000,"rows_last":500,"rows_between":2000,"halvings":0,"cell_chars":16384,"cell_head_chars":4096},"cells_cut":0,"cells_raw":0,"read":"whole","date_system":"1900"}

{"sheet":"Description of columns","index":0,"n_rows":21,"n_cols":3,"rows_kept":21,"cut":false,"hidden":false,"merged":[[10,2,12,2],[14,2,15,2],[18,2,20,2]]}
["This list describes the column headings in the main \"Measures\" sheet"]
[]
["Column letter","Column heading","Description"]
["A","Identification number","Unique identifier per line"]
["B","Country","3-letter country code"]
["C","Type of measure","Categorisatioin of policy type"]
["D","Scope","Economy-wide, sectoral, sub-national etc"]
["E","Sector","Which sector(s) covered"]
["F","Value of measure (USD or specify)","Total value of funding announced (if applicable)"]
["G","Infrastructure relevant?","Relevant to infrastructure or not"]
["H","Environmental dimension 1","Up to three environmental dimensions potentially affected by the measure (positively or negatively)"]
["I","Environmental dimension 2"]
["J","Environmental dimension 3"]
["K","Summary description","Description of measure"]
["L","Source","Online source for data"]
["M","Source 2"]
["N","Comments"]
["O","Updated on","Date that the entry was last updated"]
["P","Original currency","Currency conversion fields"]
["Q","Original value (million)"]
["R","Convert to USD millions"]

{"sheet":"Measures","index":1,"n_rows":858,"n_cols":22,"rows_kept":858,"cut":false,"hidden":false,"merged":[]}
["Identification number","Country","Type of measure","Scope","Sector","Value of measure (USD or specify)","Environmental dimension 1","Environmental dimension 2","Environmental dimension 3","Summary description","Source 1","Source 2","Environmental impact category\n","Comments","Updated on","Million original currency","Million original currency","Convert to USD millions","Country comments/\nRevisions"]
["AUS1","AUS","Grant/Loan (including interest-free loans)","Sectoral","Air transport","AUD 100m","Climate Mitigation",null,null,"Regional Airlines Funding Assistance - assist smaller regional domestic air service providers to help manage cash flow issues they may be experiencing as a result of the mpacts of the Coronavirus.","https://treasury.gov.au/sites/default/files/2020-07/Fact_Sheet-COVID-19_Relief_Fund.pdf",null,"Negative",null,null,"AUD",100,{"$f":"IFERROR(Q2/VLOOKUP(P2,'Exchange rates to USD'!$L$2:$N$225,3,FALSE()),\"\")","v":70.7021032604051}]
["AUS2","AUS","Grant/Loan (including interest-free loans)","Sectoral","Air transport","AUD 198m","Climate Mitigation",null,null,"Regional Network Air Assistance -  to assist domestic commercial airlines to maintain a basic level of connectivity across their network of regional routes. This is supporting critical air services, connecting regional Australia to freight, medical testing, supplies and essential personnel.","https://treasury.gov.au/sites/default/files/2020-07/Fact_Sheet-COVID-19_Relief_Fund.pdf",null,"Indeterminate",null,null,"AUD",198,{"$f":"IFERROR(Q3/VLOOKUP(P3,'Exchange rates to USD'!$L$2:$N$225,3,FALSE()),\"\")","v":139.990164455602}]
["AUS3","AUS","Grant/Loan (including interest-free loans)","Sectoral","Air transport","AUD 110m","Climate Mitigation",null,null,"Airfreight Support - an International Freight Assistance Mechanism (IFAM) to keep open key international freight links with trading partners for goods coming into and going out of Australia. IFAM will support the efforts of businesses trading internationally, including in the agricultural, seafood and healthcare sectors, to re-establish key global supply chains, which have been disrupted by the Coronavirus, supporting the international economic recovery. ","https://treasury.gov.au/sites/default/files/2020-07/Fact_Sheet-COVID-19_Relief_Fund.pdf",null,"Negative",null,null,"AUD",110,{"$f":"IFERROR(Q4/VLOOKUP(P4,'Exchange rates to USD'!$L$2:$N$225,3,FALSE()),\"\")","v":77.7723135864456}]
["AUS4","AUS","Tax reduction / Other subsidy","Sectoral","Multiple or economy-wide",null,"Biodiversity",null,null,"Levy Relief from Commonwealth Fisheries - The Australian Government is waiving the final two instalments of levies for Commonwealth managed fisheries, reducing levies for the 2019-20 financial year by two thirds. No estimate of revenue foregone provided","https://treasury.gov.au/sites/default/files/2020-07/Fact_Sheet-COVID-19_Relief_Fund.pdf",null,"Indeterminate",null,null,null,null,{"$f":"IFERROR(Q5/VLOOKUP(P5,'Exchange rates to USD'!$L$2:$N$225,3,FALSE()),\"\")","v":""}]
["AUS5","AUS","Tax reduction / Other subsidy","Economy-wide","Multiple or economy-wide","AUD 12m","Biodiversity",null,null,"Fee Waivers for Commonwealth National Parks plus support for businesses operating in Commonwealth National Parks","https://treasury.gov.au/sites/default/files/2020-07/Fact_Sheet-COVID-19_Relief_Fund.pdf",null,"Indeterminate",null,null,"AUD",12,{"$f":"IFERROR(Q6/VLOOKUP(P6,'Exchange rates to USD'!$L$2:$N$225,3,FALSE()),\"\")","v":8.48425239124861}]
["AUS6","AUS","Tax reduction / Other subsidy","Sectoral","Multiple or economy-wide","AUD 8.1m","Biodiversity",null,null,"Temporary waiver of environmental management change in the Great Barrier Reef Marine Park","https://treasury.gov.au/sites/default/files/2020-07/Fact_Sheet-COVID-19_Relief_Fund.pdf",null,"Negative",null,null,"AUD",8.1,{"$f":"IFERROR(Q7/VLOOKUP(P7,'Exchange rates to USD'!$L$2:$N$225,3,FALSE()),\"\")","v":5.72687036409281}]
["AUS7","AUS","Grant/Loan (including interest-free loans)","Sectoral","Multiple or economy-wide","AUD 4m","Biodiversity",null,null,"Seafood Sector COVID-19 Support - \"Eat Seafood Australia\" Campaign","https://treasury.gov.au/sites/default/files/2020-07/Fact_Sheet-COVID-19_Relief_Fund.pdf",null,"Indeterminate",null,null,"AUD",4,{"$f":"IFERROR(Q8/VLOOKUP(P8,'Exchange rates to USD'!$L$2:$N$225,3,FALSE()),\"\")","v":2.8280841304162}]
["AUS8","AUS","Grant/Loan (including interest-free loans)","Sectoral","Industry","AUD 10m","Biodiversity",null,null,"Securing forestry resources for economic recovery -  funding to Australia’s forestry industries to help manage the compounding effects of the Coronavirus crisis and the 2019-20 bushfire season. This initiative will safeguard the future timber supply by assisting with the storage of fire-affected salvage logs, processed timber products, and other forestry products. ","https://treasury.gov.au/sites/default/files/2020-07/Fact_Sheet-COVID-19_Relief_Fund.pdf",null,"Positive",null,null,"AUD",10,{"$f":"IFERROR(Q9/VLOOKUP(P9,'Exchange rates to USD'!$L$2:$N$225,3,FALSE()),\"\")","v":7.07021032604051}]
["AUS9","AUS","Tax reduction / Other subsidy","Sectoral","Energy",null,"Waste & recycling","Water",null,"Temporary oil recycling sector support -  temporarily increases the subsidy paid to oil recyclers under the Product Stewardship Oil Scheme for category one oil from 50 cents per litre to 62 cents per litre. The Australian Government established the Product Stewardship Oil Scheme in 2001 to address the mismanagement of unconsumed used oils. The Australian Government pays a benefit to oil recyclers to incentivise the collection and re-refinement of waste oil. No estimate of subsidy provided.","https://treasury.gov.au/sites/default/files/2020-07/Fact_Sheet-COVID-19_Relief_Fund.pdf",null,"Positive",null,null,null,null,{"$f":"IFERROR(Q10/VLOOKUP(P10,'Exchange rates to USD'!$L$2:$N$225,3,FALSE()),\"\")","v":""}]
["AUS10","AUS","Grant/Loan (including interest-free loans)","Sectoral","Air transport","AUD 715m","Climate Mitigation",null,null,"Support for Australian Airlines and Airports - The Government will provide initial support to our airline industry through an estimated $715 million package of relief from a range of taxes and Government charges. This will include reimbursement of aviation fuel taxes, relief of Airservices Australia charges, rebate for Domestic Aviation Security, funding Regional Aviation Security.","https://treasury.gov.au/sites/default/files/2020-03/Fact_sheet-Assistance_for_severely_affected_regions_and_sectors.pdf",null,"Negative",null,null,"AUD",715,{"$f":"IFERROR(Q11/VLOOKUP(P11,'Exchange rates to USD'!$L$2:$N$225,3,FALSE()),\"\")","v":505.520038311896}]
["AUS11","AUS","Grant/Loan (including interest-free loans)","Economy-wide","Multiple or economy-wide","AUD 1 billion","Other",null,null,"Support for Coronavirus-affected Regions, Communities and Industries","https://treasury.gov.au/sites/default/files/2020-03/Fact_sheet-Assistance_for_severely_affected_regions_and_sectors.pdf",null,"Indeterminate",null,null,"AUD",1000,{"$f":"IFERROR(Q12/VLOOKUP(P12,'Exchange rates to USD'!$L$2:$N$225,3,FALSE()),\"\")","v":707.021032604051}]
["AUS12","AUS","Grant/Loan (including interest-free loans)","City/regional","Multiple or economy-wide","AUD 51.8 billion","Climate Mitigation","Air Pollution","Other","Infrastructure guarantee fund - maintaining the current State infrastructure investment program at $51.8 billion over the next four years 2019-20 to 2022-23","https://www.covid19.qld.gov.au/government-actions/our-economic-recovery-strategy",null,"Mixed",null,null,"AUD",51800,{"$f":"IFERROR(Q13/VLOOKUP(P13,'Exchange rates to USD'!$L$2:$N$225,3,FALSE()),\"\")","v":36623.6894888898}]
["AUS13","AUS","Grant/Loan (including interest-free loans)","Sector-specific","Buildings",null,"Biodiversity",null,null,"HomeBuilder provides eligible owner-occupiers (including first home buyers) with a grant to build a new home or substantially renovate an existing home. HomeBuilder assists the residential construction sector by encouraging the commencement of new home builds and renovations.","https://treasury.gov.au/coronavirus/homebuilder","https://treasury.gov.au/sites/default/files/2020-12/HomeBuilder_extension_factsheet.pdf","Indeterminate",null,"2021-03-05",null,null,null,"changed dimension from biodiversity to climate. Change impact to mixed/No Infrast. relevant? The measure is expected to have an impact of AUD 921 million"]
["AUS14","AUS","Regulatory change","Sector-specific","Agriculture","AUD 14.4m","Other",null,null,"Improving Regulation post-COVID-19 including Targeted Interventions for Seafood and Live Animal Exporters","https://www.awe.gov.au/sites/default/files/2020-10/budget-2020-21_cultivating-profitable-and-resilient-agricultural-businesses.pdf",null,"Indeterminate",null,"2021-04-08","AUD",14.4,{"$f":"IFERROR(Q15/VLOOKUP(P15,'Exchange rates to USD'!$L$2:$N$225,3,FALSE()),\"\")","v":10.1811028694983}]
["AUS15","AUS","Other","Sector-specific","Buildings","AUD 40.6m","Biodiversity",null,null,"Protecting and restoring Sydney Harbour Federation Trust properties","https://www.awe.gov.au/sites/default/files/2020-10/budget-2020-21_protecting-our-iconic-places.pdf",null,"Indeterminate",null,"2021-04-08","AUD",40.6,{"$f":"IFERROR(Q16/VLOOKUP(P16,'Exchange rates to USD'!$L$2:$N$225,3,FALSE()),\"\")","v":28.7050539237245}]
["AUS16","AUS","Grant/Loan (including interest-free loans)","Sector-specific","Multiple or economy-wide","AUD 3.2m","Biodiversity","Water",null,"Great Barrier Reef tourism industry activation and reef protection, maintenance and monitoring.","https://www.awe.gov.au/sites/default/files/2020-10/budget-2020-21_protecting-our-iconic-places.pdf",null,"Indeterminate",null,"2021-04-08","AUD",3.2,{"$f":"IFERROR(Q17/VLOOKUP(P17,'Exchange rates to USD'!$L$2:$N$225,3,FALSE()),\"\")","v":2.26246730433296}]
["AUS17","AUS","Grant/Loan (including interest-free loans)","Sector-specific","Multiple or economy-wide","AUD 5.5m","Other","Biodiversity",null,"Supplementing GBRMPA for waiving environmental management charges","https://www.awe.gov.au/sites/default/files/2020-10/budget-2020-21_protecting-our-iconic-places.pdf",null,"Indeterminate",null,"2021-04-08","AUD",5.5,{"$f":"IFERROR(Q18/VLOOKUP(P18,'Exchange rates to USD'!$L$2:$N$225,3,FALSE()),\"\")","v":3.88861567932228}]
["AUS18","AUS","Tax reduction / other subsidy","Sector-specific","Multiple or economy-wide","AUD 6m","Other","Biodiversity",null,"Extending waiver of the GBRMPA Environment Management Charge","https://www.awe.gov.au/sites/default/files/2020-10/budget-2020-21_protecting-our-iconic-places.pdf",null,"Indeterminate",null,"2021-04-08","AUD",6,{"$f":"IFERROR(Q19/VLOOKUP(P19,'Exchange rates to USD'!$L$2:$N$225,3,FALSE()),\"\")","v":4.24212619562431}]
["AUS19","AUS","Grant/Loan (including interest-free loans)","Sector-specific","Multiple or economy-wide","AUD 11.2m","Other","Biodiversity",null,"Supplementing our National Parks for waiving park entry fees to Kakadu, Uluru Kata-Tjuta and Booderee, to provide incentives for travellers to visit after restrictions relax ","https://www.awe.gov.au/sites/default/files/2020-10/budget-2020-21_protecting-our-iconic-places.pdf",null,"Indeterminate",null,"2021-04-08","AUD",11.2,{"$f":"IFERROR(Q20/VLOOKUP(P20,'Exchange rates to USD'!$L$2:$N$225,3,FALSE()),\"\")","v":7.91863556516537}]
["AUS20","AUS","Grant/Loan (including interest-free loans)","Sector-specific","Multiple or economy-wide","AUD 5m","Other",null,null,"Support critical capital works and capital projects to refurbish and replace external structures at Reef HQ.","https://www.infrastructure.gov.au/department/statements/2020_2021/ministerial-statement/agriculture-water-environment.aspx#new",null,"Positive",null,"2021-04-08","AUD",5,{"$f":"IFERROR(Q21/VLOOKUP(P21,'Exchange rates to USD'!$L$2:$N$225,3,FALSE()),\"\")","v":3.53510516302025}]
["AUS21","AUS","Other","Sector-specific","Waste management","AUD 59.6m","Waste & recycling",null,null,"National Waste Policy Action Plan implementation","https://www.awe.gov.au/sites/default/files/2020-10/budget-2020-21_transforming-waste-recycling.pdf",null,"Positive",null,"2021-04-08","AUD",59.6,{"$f":"IFERROR(Q22/VLOOKUP(P22,'Exchange rates to USD'!$L$2:$N$225,3,FALSE()),\"\")","v":42.1384535432014}]
["AUS22","AUS","Other","Sector-specific","Waste management","AUD 190m","Waste & recycling",null,null,"Recycling Modernisation Fund - will support waste recovery and combined with the National Waste Policy Action Plan will create over 10,000 jobs over the next 10 years. ","https://www.awe.gov.au/sites/default/files/2020-10/budget-2020-21_transforming-waste-recycling.pdf",null,"Positive",null,"2021-04-08","AUD",190,{"$f":"IFERROR(Q23/VLOOKUP(P23,'Exchange rates to USD'!$L$2:$N$225,3,FALSE()),\"\")","v":134.33399619477}]
["AUS23","AUS","Other","Sector-specific","Multiple or economy-wide","AUD 2.5m","Biodiversity","Adaptation",null,"Exploring market-based solutions for habitat restoration","https://www.awe.gov.au/sites/default/files/2020-10/budget-2020-21_reforming-environmental-laws-regulations_0.pdf",null,"Positive",null,"2021-04-08","AUD",2.5,{"$f":"IFERROR(Q24/VLOOKUP(P24,'Exchange rates to USD'!$L$2:$N$225,3,FALSE()),\"\")","v":1.76755258151013}]
["AUS24","AUS","Grant/Loan (including interest-free loans)","City/regional","Multiple or economy-wide","AUD 37.6m","Biodiversity","Water",null,"Projects that will sustain South Australia Riverland environments","https://www.awe.gov.au/sites/default/files/2020-10/budget_2020-21_investing-in-communities-and-building-confidence-in-the-basin-plan.pdf",null,"Positive",null,"2021-04-08","AUD",37.6,{"$f":"IFERROR(Q25/VLOOKUP(P25,'Exchange rates to USD'!$L$2:$N$225,3,FALSE()),\"\")","v":26.5839908259123}]
["AUS25","AUS","Grant/Loan (including interest-free loans)","City/regional","Multiple or economy-wide","AUD 24.5m","Biodiversity","Water",null,"Community driven projects to improve the health of rivers and wetlands","https://www.awe.gov.au/sites/default/files/2020-10/budget_2020-21_investing-in-communities-and-building-confidence-in-the-basin-plan.pdf",null,"Positive",null,"2021-04-08","AUD",24.5,{"$f":"IFERROR(Q26/VLOOKUP(P26,'Exchange rates to USD'!$L$2:$N$225,3,FALSE()),\"\")","v":17.3220152987992}]
["AUS26","AUS","Other","City/regional","Multiple or economy-wide","AUD 4.2m","Biodiversity",null,null,"First Nations River Ranger Program","https://www.awe.gov.au/sites/default/files/2020-10/budget_2020-21_investing-in-communities-and-building-confidence-in-the-basin-plan.pdf",null,"Positive",null,"2021-04-08","AUD",4.2,{"$f":"IFERROR(Q27/VLOOKUP(P27,'Exchange rates to USD'!$L$2:$N$225,3,FALSE()),\"\")","v":2.96948833693701}]
["AUS27","AUS","Other","City/regional","Multiple or economy-wide","AUD 20m","Biodiversity","Water",null,"Reef builder - aiding the recovery of coastal communities","https://www.awe.gov.au/sites/default/files/2020-10/budget-2020-21_supporting-healthy-oceans.pdf",null,"Positive",null,"2021-04-08","AUD",20,{"$f":"IFERROR(Q28/VLOOKUP(P28,'Exchange rates to USD'!$L$2:$N$225,3,FALSE()),\"\")","v":14.140420652081}]
["AUS28","AUS","Skills training","City/regional","Multiple or economy-wide","AUD 23m","Biodiversity","Adaptation",null,"Green jobs - Employment of people with no prior skill in environmental restoration and conservation","Green Recovery Measures for Western Australia - Sustainable Recovery 2020 (iisd.org)",null,"Positive",null,"2021-04-08","AUD",23,{"$f":"IFERROR(Q29/VLOOKUP(P29,'Exchange rates to USD'!$L$2:$N$225,3,FALSE()),\"\")","v":16.2614837498932}]
["AUS29","AUS","Grant/Loan (including interest-free loans)","Sector-specific","Energy","AUD 10m","Climate Mitigation","Air Pollution",null,"Investment directed towards the Clean Energy Future Fund to invest in clean energy technologies","Green Recovery Measures for Western Australia - Sustainable Recovery 2020 (iisd.org)",null,"Positive",null,"2021-04-08","AUD",10,{"$f":"IFERROR(Q30/VLOOKUP(P30,'Exchange rates to USD'!$L$2:$N$225,3,FALSE()),\"\")","v":7.07021032604051}]
{"$rows_left_out":829}
{"sheet":"Exchange rates to USD","index":2,"n_rows":46,"n_cols":14,"rows_kept":46,"cut":false,"hidden":false,"merged":[]}
[null,null,null,null,null,null,"2019 EXCHANGE RATES",null,null,"ISO","COUNTRY","natcurrency_code","y2019","y2020"]
[null,null,null,null,null,null,null,null,null,"AUS","Australia","AUD",1.43850696086884,1.41438508033752]
[null,null,null,null,null,null,null,null,null,"AUT","Austria","EUR",0.89327597618103,0.906890511512756]
[null,null,null,null,null,null,null,null,null,"BEL","Belgium","EUR",0.89327597618103,0.906890511512756]
[null,null,null,null,null,null,null,null,null,"CAN","Canada","CAD",1.32685399055481,1.30981767177582]
[null,null,null,null,null,null,null,null,null,"CHE","Switzerland","CHF",0.993840992450714,1.0495491027832]
[null,null,null,null,null,null,null,null,null,"CHL","Chile","CLP",702.897399902344,622.558776855469]
[null,null,null,null,null,null,null,null,null,"COL","Colombia","COP",3280.83154296875,2880.34448242187]
[null,null,null,null,null,null,null,null,null,"CZE","Czech Republic","CZK",22.9322490692139,22.510705947876]
[null,null,null,null,null,null,null,null,null,"DEU","Germany","EUR",0.89327597618103,0.906890511512756]
[null,null,null,null,null,null,null,null,null,"DNK","Denmark","DKK",6.66944694519043,6.77768421173096]
[null,null,null,null,null,null,null,null,null,"ESP","Spain","EUR",0.89327597618103,0.906890511512756]
[null,null,null,null,null,null,null,null,null,"EST","Estonia","EUR",0.89327597618103,0.906890511512756]
[null,null,null,null,null,null,null,null,null,"FIN","Finland","EUR",0.89327597618103,0.906890511512756]
[null,null,null,null,null,null,null,null,null,"FRA","France","EUR",0.89327597618103,0.906890511512756]
[null,null,null,null,null,null,null,null,null,"GBR","United Kingdom","GBP",0.783445000648499,0.784878492355347]
[null,null,null,null,null,null,null,null,null,"GRC","Greece","EUR",0.89327597618103,0.906890511512756]
[null,null,null,null,null,null,null,null,null,"HUN","Hungary","HUF",290.660003662109,272.606903076172]
[null,null,null,null,null,null,null,null,null,"IRL","Ireland","EUR",0.89327597618103,0.906890511512756]
[null,null,null,null,null,null,null,null,null,"ISL","Iceland","ISK",122.606773376465,110.013572692871]
[null,null,null,null,null,null,null,null,null,"ISR","Israel","ILS",3.56452703475952,3.67140197753906]
[null,null,null,null,null,null,null,null,null,"ITA","Italy","EUR",0.89327597618103,0.906890511512756]
[null,null,null,null,null,null,null,null,null,"JPN","Japan","JPY",109.009666442871,111.220710754395]
[null,null,null,null,null,null,null,null,null,"KOR","Korea","KRW",1165.49890136719,1146.26000976563]
[null,null,null,null,null,null,null,null,null,"LTU","Lithuania","EUR",0.89327597618103,0.906890511512756]
[null,null,null,null,null,null,null,null,null,"LUX","Luxembourg","EUR",0.89327597618103,0.906890511512756]
[null,null,null,null,null,null,null,null,null,"LVA","Latvia","EUR",0.89327597618103,0.906890511512756]
[null,null,null,null,null,null,null,null,null,"MEX","Mexico","MXN",19.2636337280273,17.2222442626953]
[null,null,null,null,null,null,null,null,null,"NLD","Netherlands","EUR",0.89327597618103,0.906890511512756]
[null,null,null,null,null,null,null,null,null,"NOR","Norway","NOK",8.80000019073486,8.15642166137695]
{"$rows_left_out":17}
{"sheet":"selection lists","index":3,"n_rows":11,"n_cols":14,"rows_kept":11,"cut":false,"hidden":false,"merged":[]}
["Type of measure",null,"Sub-type of measure",null,"Scope",null,null,"Sector",null,"Yes/No",null,"Environmental focus 1",null,"Positive/Negative/Indeterminate"]
["Policy",null,"Tax reduction / other subsidy",null,"Sectoral",null,null,"Energy",null,"No",null,"Climate",null,"Indeterminate"]
["Fiscal",null,"Grant/Loan (including interest-free loans)",null,"Economy-wide",null,null,"Surface transport",null,"Yes",null,"Air Pollution",null,"Mixed"]
["Monetary",null,"Regulatory change",null,"City/regional",null,null,"Multiple or n.a.",null,"n/a",null,"Biodiversity",null,"Negative"]
[null,null,"Other or not specified",null,"Sector-specific",null,null,"Agriculture",null,null,null,"Water",null,"Positive"]
[null,null,"Skills training",null,null,null,null,"Industry",null,null,null,"Other"]
[null,null,"R&D subsidies",null,null,null,null,"Buildings",null,null,null,"Waste & recycling"]
[null,null,null,null,null,null,null,"Air transport",null,null,null,"Plastics"]
[null,null,null,null,null,null,null,"Forestry",null,null,null,"Adaptation"]
[null,null,null,null,null,null,null,"Maritime transport"]
[null,null,null,null,null,null,null,"Waste management"]